BDBM50098594 CHEMBL3594302
SMILES Nc1nccc2cc(NC3c4ccc(OCCCC(=O)Nc5cccc(CNC3=O)c5)cc4)ccc12
InChI Key InChIKey=PZWZIARVTFDAIU-UHFFFAOYSA-N
Data  1 KI
  Tab Delimited (TSV)   2D SDfile   Computed 3D by Vconf -m prep SDfile
Find this compound or compounds like it in BindingDB:
Activity Spreadsheet -- Enzyme Inhibition Constant Data from BindingDB
Found 1 hit for monomerid = 50098594
TargetCoagulation factor VII/Tissue factor(Homo sapiens (Human))
TBA
Curated by ChEMBL
LigandPNGBDBM50098594(CHEMBL3594302)
Affinity DataKi:  4.60E+3nM. Assay description: Inhibition of human recombinant TF/F7a complex using S2288 as substrate preincubated for 15 mins followed by protein addition measured for 60 mins
In DepthDetails ArticlePubMed