BDBM50098795 CHEMBL3593340
SMILES CC(C)(C)c1cc(no1)C(=O)C(=N\Nc1ccc(F)c(F)c1)\C#N
InChI Key InChIKey=KHIDICSNQISIEH-FYJGNVAPSA-N
Data  1 IC50
  Tab Delimited (TSV)   2D SDfile   Computed 3D by Vconf -m prep SDfile
Find this compound or compounds like it in BindingDB:
Activity Spreadsheet -- Enzyme Inhibition Constant Data from BindingDB
Found 1 hit for monomerid = 50098795
TargetRap guanine nucleotide exchange factor 4(Mus musculus)
University Of Texas Medical Branch
Curated by ChEMBL
LigandPNGBDBM50098795(CHEMBL3593340)
Affinity DataIC50:  6.60E+3nM. Assay description: Displacement of 8-NBD-cAMP from mouse recombinant EPAC2 by fluorescence assay
In DepthDetails ArticlePubMed