BDBM50098808 CHEMBL3334776
SMILES Clc1ccc(cc1Cl)C(CCN1CCOCC1)N1CCCC1
InChI Key InChIKey=UPVLRNUPSLZGHM-UHFFFAOYSA-N
Data  3 IC50
  Tab Delimited (TSV)   2D SDfile   Computed 3D by Vconf -m prep SDfile
Find this compound or compounds like it in BindingDB:
Activity Spreadsheet -- Enzyme Inhibition Constant Data from BindingDB
Found 3 hits for monomerid = 50098808
TargetSodium-dependent serotonin transporter(Homo sapiens (Human))
Shanghai Institute Of Pharmaceutical Industry
Curated by ChEMBL
LigandPNGBDBM50098808(CHEMBL3334776)
Affinity DataIC50:  389nM. Assay description: Inhibition of [3H]-serotonin uptake in human SERT expressed in HEK293 cells by scintillation counting
In DepthDetails ArticlePubMed
TargetSodium-dependent dopamine transporter(Homo sapiens (Human))
Shanghai Institute Of Pharmaceutical Industry
Curated by ChEMBL
LigandPNGBDBM50098808(CHEMBL3334776)
Affinity DataIC50:  238nM. Assay description: Inhibition of [3H]-DA uptake in human dopamine transporter expressed in HEK293 cells by scintillation counting
In DepthDetails ArticlePubMed
TargetSodium-dependent noradrenaline transporter(Homo sapiens (Human))
Shanghai Institute Of Pharmaceutical Industry
Curated by ChEMBL
LigandPNGBDBM50098808(CHEMBL3334776)
Affinity DataIC50:  69nM. Assay description: Inhibition of [3H]-NE uptake in human norepinephrine transporter expressed in HEK293 cells by scintillation counting
In DepthDetails ArticlePubMed