BDBM50099099 (S)-1-[(S)-2-(4-Hydroxy-3-methoxy-phenyl)-4,5-dihydro-oxazol-4-ylmethoxycarbonyl]-2-methyl-butyl-ammonium
SMILES CCC(C)[C@H]([NH3+])C(=O)OC[C@@H]1COC(=N1)c1ccc(O)c(OC)c1
InChI Key InChIKey=ZUSYNLVQDYLJOD-QKHYJBKJSA-O
Data  1 IC50
  Tab Delimited (TSV)   2D SDfile   Computed 3D by Vconf -m prep SDfile
Find this compound or compounds like it in BindingDB:
Activity Spreadsheet -- Enzyme Inhibition Constant Data from BindingDB
Found 1 hit for monomerid = 50099099
TargetIsoleucine--tRNA ligase, cytoplasmic(Homo sapiens (Human))
Seoul National University
Curated by ChEMBL
LigandPNGBDBM50099099((S)-1-[(S)-2-(4-Hydroxy-3-methoxy-phenyl)-4,5-dihy...)
Affinity DataIC50:  3.86E+4nM. Assay description: Inhibitory concentration against isoleucyl-tRNA synthetase was determined by measuring decrease of the aminoacylation product [3H]- isoleucyl tRNA of...
In DepthDetails ArticlePubMed