BDBM50099207 CHEMBL36215::Terephthalic acid mono-(1-benzoyl-3-benzyl-4-oxo-azetidin-2-ylmethyl) ester
SMILES OC(=O)c1ccc(cc1)C(=O)OC[C@@H]1[C@H](Cc2ccccc2)C(=O)N1C(=O)c1ccccc1
InChI Key InChIKey=FUIJJPGTKXTOCC-FCHUYYIVSA-N
Data  1 IC50
  Tab Delimited (TSV)   2D SDfile   Computed 3D by Vconf -m prep SDfile
Find this compound or compounds like it in BindingDB:
Activity Spreadsheet -- Enzyme Inhibition Constant Data from BindingDB
Found 1 hit for monomerid = 50099207
TargetGlutamate carboxypeptidase 2(Homo sapiens (Human))
University Of Oxford
Curated by ChEMBL
LigandPNGBDBM50099207(CHEMBL36215 | Terephthalic acid mono-(1-benzoyl-3-...)
Affinity DataIC50: >1.00E+5nM. Assay description: Inhibition of Prostate specific antigen PSA (Serine Protease)
In DepthDetails ArticlePubMed