BDBM50099228 1-[3-(6-Iodo-naphthalen-2-yl)-8-methyl-8-aza-bicyclo[3.2.1]oct-2-yl]-propan-1-one::CHEMBL287945
SMILES CCC(=O)C1C2CCC(CC1c1ccc3cc(I)ccc3c1)N2C
InChI Key InChIKey=HPOGLTQFYAJYLV-UHFFFAOYSA-N
Data  1 KI  1 IC50
  Tab Delimited (TSV)   2D SDfile   Computed 3D by Vconf -m prep SDfile
Find this compound or compounds like it in BindingDB:
Activity Spreadsheet -- Enzyme Inhibition Constant Data from BindingDB
Found 2 hits for monomerid = 50099228
TargetSodium-dependent serotonin transporter(Rattus norvegicus (rat))
State University Of New York
Curated by ChEMBL
LigandPNGBDBM50099228(1-[3-(6-Iodo-naphthalen-2-yl)-8-methyl-8-aza-bicyc...)
Affinity DataKi:  0.370nM. Assay description: Affinity for the displacement of [3H]-paroxetine binding to serotonin transporter (SERT) in rat frontal cortex membranes
In DepthDetails ArticlePubMed
TargetSodium-dependent dopamine transporter(Rattus norvegicus (rat))
State University Of New York
Curated by ChEMBL
LigandPNGBDBM50099228(1-[3-(6-Iodo-naphthalen-2-yl)-8-methyl-8-aza-bicyc...)
Affinity DataIC50:  0.350nM. Assay description: Inhibitory activity in displacing [125I]- RTI-55 binding to dopamine transporter in rat striatal membranes
In DepthDetails ArticlePubMed