BDBM50099292 3N-{3-[4-(4-chlorophenyl)-1-methyl-(3R,4S)-hexahydro-3-pyridinylcarboxamido]propyl}-4-(4-chlorophenyl)-1-methyl-(3R,4S)-hexahydro-3-pyridinecarboxamide::CHEMBL296043
SMILES CN1CC[C@@H]([C@H](C1)C(=O)NCCCNC(=O)[C@H]1CN(C)CC[C@@H]1c1ccc(Cl)cc1)c1ccc(Cl)cc1
InChI Key InChIKey=YXUHGNSTVHJZTH-XDZXDJIYSA-N
Data  4 KI
  Tab Delimited (TSV)   2D SDfile   Computed 3D by Vconf -m prep SDfile
Find this compound or compounds like it in BindingDB:
Activity Spreadsheet -- Enzyme Inhibition Constant Data from BindingDB
Found 4 hits for monomerid = 50099292
TargetSodium-dependent dopamine transporter(Rattus norvegicus (rat))
Georgetown University Medical Center
Curated by ChEMBL
LigandPNGBDBM50099292(3N-{3-[4-(4-chlorophenyl)-1-methyl-(3R,4S)-hexahyd...)
Affinity DataKi:  8.40nM. Assay description: Displacement of [3H]mazindol binding to dopamine transporter (DAT) in rat synaptosomes
In DepthDetails ArticlePubMed
TargetSodium-dependent dopamine transporter(Rattus norvegicus (rat))
Georgetown University Medical Center
Curated by ChEMBL
LigandPNGBDBM50099292(3N-{3-[4-(4-chlorophenyl)-1-methyl-(3R,4S)-hexahyd...)
Affinity DataKi:  14nM. Assay description: Inhibition of high affinity DA uptake into rat synaptosomes using [3H]DA
In DepthDetails ArticlePubMed
TargetTransporter(Rattus norvegicus)
Georgetown University Medical Center
Curated by ChEMBL
LigandPNGBDBM50099292(3N-{3-[4-(4-chlorophenyl)-1-methyl-(3R,4S)-hexahyd...)
Affinity DataKi:  146nM. Assay description: Ability to inhibit high affinity uptake of norepinephrine transporter into the nerve endings of rat synaptosomes using [3H]NE as a radioligand
In DepthDetails ArticlePubMed
TargetSodium-dependent serotonin transporter(Rattus norvegicus (rat))
Georgetown University Medical Center
Curated by ChEMBL
LigandPNGBDBM50099292(3N-{3-[4-(4-chlorophenyl)-1-methyl-(3R,4S)-hexahyd...)
Affinity DataKi:  566nM. Assay description: Inhibition of high affinity serotonin uptake into rat synaptosomes using [3H]5-HT
In DepthDetails ArticlePubMed