BDBM50099300 3N-{8-[4-(4-chlorophenyl)-1-methyl-(3S,4R)-hexahydro-3-pyridinylcarboxamido]octyl}-4-(4-chlorophenyl)-1-methyl-(3S,4R)-hexahydro-3-pyridinecarboxamide::CHEMBL43386
SMILES CN1CC[C@H]([C@@H](C1)C(=O)NCCCCCCCCNC(=O)[C@@H]1CN(C)CC[C@H]1c1ccc(Cl)cc1)c1ccc(Cl)cc1
InChI Key InChIKey=HEABXBKCOZEPLO-GASGPIRDSA-N
Data  3 KI
  Tab Delimited (TSV)   2D SDfile   Computed 3D by Vconf -m prep SDfile
Find this compound or compounds like it in BindingDB:
Activity Spreadsheet -- Enzyme Inhibition Constant Data from BindingDB
Found 3 hits for monomerid = 50099300
TargetSodium-dependent serotonin transporter(Rattus norvegicus (rat))
Georgetown University Medical Center
Curated by ChEMBL
LigandPNGBDBM50099300(3N-{8-[4-(4-chlorophenyl)-1-methyl-(3S,4R)-hexahyd...)
Affinity DataKi:  2.10nM. Assay description: Inhibition of high affinity serotonin uptake into rat synaptosomes using [3H]5-HT
In DepthDetails ArticlePubMed
TargetTransporter(Rattus norvegicus)
Georgetown University Medical Center
Curated by ChEMBL
LigandPNGBDBM50099300(3N-{8-[4-(4-chlorophenyl)-1-methyl-(3S,4R)-hexahyd...)
Affinity DataKi:  1.04E+3nM. Assay description: Ability to inhibit high affinity uptake of norepinephrine transporter into the nerve endings of rat synaptosomes using [3H]NE as a radioligand
In DepthDetails ArticlePubMed
TargetSodium-dependent dopamine transporter(Rattus norvegicus (rat))
Georgetown University Medical Center
Curated by ChEMBL
LigandPNGBDBM50099300(3N-{8-[4-(4-chlorophenyl)-1-methyl-(3S,4R)-hexahyd...)
Affinity DataKi:  3.18E+3nM. Assay description: Ability to inhibit high affinity uptake of DA into the nerve endings of rat synaptosomes using [3H]DA as a radioligand
In DepthDetails ArticlePubMed