BDBM50099348 2-(2,4-Dimethyl-phenoxy)-4-[5-(4-fluoro-phenyl)-3-piperidin-4-yl-3H-imidazol-4-yl]-pyrimidine::CHEMBL13850
SMILES Cc1ccc(Oc2nccc(n2)-c2c(ncn2C2CCNCC2)-c2ccc(F)cc2)c(C)c1
InChI Key InChIKey=LUJGQXQCHRYWMJ-UHFFFAOYSA-N
Data  2 IC50
  Tab Delimited (TSV)   2D SDfile   Computed 3D by Vconf -m prep SDfile
Find this compound or compounds like it in BindingDB:
Activity Spreadsheet -- Enzyme Inhibition Constant Data from BindingDB
Found 2 hits for monomerid = 50099348
TargetMitogen-activated protein kinase 14(Homo sapiens (Human))
University College Of Pharmaceutical Sciences
Curated by ChEMBL
LigandPNGBDBM50099348(2-(2,4-Dimethyl-phenoxy)-4-[5-(4-fluoro-phenyl)-3-...)
Affinity DataIC50:  6nM. Assay description: Inhibition of p38alpha
In DepthDetails ArticlePubMed
TargetMitogen-activated protein kinase 14(Homo sapiens (Human))
University College Of Pharmaceutical Sciences
Curated by ChEMBL
LigandPNGBDBM50099348(2-(2,4-Dimethyl-phenoxy)-4-[5-(4-fluoro-phenyl)-3-...)
Affinity DataIC50:  6nM. Assay description: Inhibitory concentration against mitogen-activated protein kinase p38 alpha
In DepthDetails ArticlePubMed