BDBM50099469 (4R)-1-[4-(benzyloxy)benzyl]-N-hydroxy-2-oxoimidazolidine-4-carboxamide::CHEMBL19583
SMILES ONC(=O)[C@H]1CN(Cc2ccc(OCc3ccccc3)cc2)C(=O)N1
InChI Key InChIKey=VKJGUUNWURODIB-MRXNPFEDSA-N
Data  2 IC50
  Tab Delimited (TSV)   2D SDfile   Computed 3D by Vconf -m prep SDfile
Find this compound or compounds like it in BindingDB:
Activity Spreadsheet -- Enzyme Inhibition Constant Data from BindingDB
Found 2 hits for monomerid = 50099469
TargetCollagenase 3(Homo sapiens (Human))
Pfizer
Curated by ChEMBL
LigandPNGBDBM50099469((4R)-1-[4-(benzyloxy)benzyl]-N-hydroxy-2-oxoimidaz...)
Affinity DataIC50:  123nM. Assay description: Inhibition of Matrix metalloproteinase-13
In DepthDetails ArticlePubMed
TargetInterstitial collagenase(Homo sapiens (Human))
Pfizer
Curated by ChEMBL
LigandPNGBDBM50099469((4R)-1-[4-(benzyloxy)benzyl]-N-hydroxy-2-oxoimidaz...)
Affinity DataIC50: >3.00E+4nM. Assay description: Inhibition of Matrix metalloproteinase-1
In DepthDetails ArticlePubMed