BDBM50099472 CHEMBL3342873
SMILES COc1ccccc1N1CCN(CC2COC3(CCN(CC3)S(C)(=O)=O)O2)CC1
InChI Key InChIKey=BWIJSERURKMDCF-UHFFFAOYSA-N
Data  4 KI
  Tab Delimited (TSV)   2D SDfile   Computed 3D by Vconf -m prep SDfile
Find this compound or compounds like it in BindingDB:
Activity Spreadsheet -- Enzyme Inhibition Constant Data from BindingDB
Found 4 hits for monomerid = 50099472
TargetAlpha-1A adrenergic receptor(Homo sapiens (Human))
Universit£
Curated by ChEMBL
LigandPNGBDBM50099472(CHEMBL3342873)
Affinity DataKi:  19nM. Assay description: Displacement of [3H]prazosin from human recombinant alpha1A adrenoceptor expressed in CHO cells after 30 mins by liquid scintillation counting
In DepthDetails ArticlePubMed
TargetAlpha-1D adrenergic receptor(Homo sapiens (Human))
Universit£
Curated by ChEMBL
LigandPNGBDBM50099472(CHEMBL3342873)
Affinity DataKi:  23nM. Assay description: Displacement of [3H]prazosin from human recombinant alpha1D adrenoceptor expressed in CHO cells after 30 mins by liquid scintillation counting
In DepthDetails ArticlePubMed
Target5-hydroxytryptamine receptor 1A(Homo sapiens (Human))
Universit£
Curated by ChEMBL
LigandPNGBDBM50099472(CHEMBL3342873)
Affinity DataKi:  145nM. Assay description: Displacement of [3H]8-OH-DPAT from human recombinant 5-HT1A receptor expressed in HeLa cells after 30 mins by liquid scintillation counting
In DepthDetails ArticlePubMed
TargetAlpha-1B adrenergic receptor(Homo sapiens (Human))
Universit£
Curated by ChEMBL
LigandPNGBDBM50099472(CHEMBL3342873)
Affinity DataKi:  363nM. Assay description: Displacement of [3H]prazosin from human recombinant alpha1B adrenoceptor expressed in CHO cells after 30 mins by liquid scintillation counting
In DepthDetails ArticlePubMed