BDBM50099574 2-(3,4-Dimethyl-phenyl)-3-[2-(4-methoxy-phenyl)-ethyl]-thiazolidin-4-one::2-(3,4-dimethylphenyl)-3-(4-methoxyphenethyl)thiazolidin-4-one::CHEMBL289939
SMILES COc1ccc(CCN2C(SCC2=O)c2ccc(C)c(C)c2)cc1
InChI Key InChIKey=MDECYZLQYSAOEI-UHFFFAOYSA-N
Data  3 IC50
  Tab Delimited (TSV)   2D SDfile   Computed 3D by Vconf -m prep SDfile
Find this compound or compounds like it in BindingDB:
Activity Spreadsheet -- Enzyme Inhibition Constant Data from BindingDB
Found 3 hits for monomerid = 50099574
TargetPotassium voltage-gated channel subfamily A member 5(Homo sapiens (Human))
Abbott Laboratories
Curated by ChEMBL
LigandPNGBDBM50099574(2-(3,4-Dimethyl-phenyl)-3-[2-(4-methoxy-phenyl)-et...)
Affinity DataIC50:  200nM. Assay description: Inhibition of voltage-gated potassium channel subunit Kv1.5
In DepthDetails ArticlePubMed
TargetPotassium voltage-gated channel subfamily A member 5(Homo sapiens (Human))
Abbott Laboratories
Curated by ChEMBL
LigandPNGBDBM50099574(2-(3,4-Dimethyl-phenyl)-3-[2-(4-methoxy-phenyl)-et...)
Affinity DataIC50:  900nM. Assay description: The inhibitory concentration for 50% was measured on cation flux
In DepthDetails ArticlePubMed
TargetPotassium voltage-gated channel subfamily A member 5(Homo sapiens (Human))
Abbott Laboratories
Curated by ChEMBL
LigandPNGBDBM50099574(2-(3,4-Dimethyl-phenyl)-3-[2-(4-methoxy-phenyl)-et...)
Affinity DataIC50:  137nM. Assay description: Inhibition of Kv1.5 mediated ultra-rapid delayed rectifier current Ikur in human atrial cells
In DepthDetails ArticlePubMed