BDBM50099892 3-[4-(4-Methylsulfanyl-phenyl)-piperazin-1-ylmethyl]-1H-pyrrolo[2,3-b]pyridine::CHEMBL28651
SMILES CSc1ccc(cc1)N1CCN(Cc2c[nH]c3ncccc23)CC1
InChI Key InChIKey=TYDSNTMUQPPTLL-UHFFFAOYSA-N
Data  23 KI
  Tab Delimited (TSV)   2D SDfile   Computed 3D by Vconf -m prep SDfile
Find this compound or compounds like it in BindingDB:
Activity Spreadsheet -- Enzyme Inhibition Constant Data from BindingDB
Found 23 hits for monomerid = 50099892
TargetD(4) dopamine receptor(RAT)
Columbia University College Of Physicians And Surgeons
Curated by ChEMBL
LigandPNGBDBM50099892(3-[4-(4-Methylsulfanyl-phenyl)-piperazin-1-ylmethy...)
Affinity DataKi:  4.70nM. Assay description: In vitro binding affinity to rat Dopamine receptor D4 measured by displacement of the radioligand [3H]-spiperone
In DepthDetails ArticlePubMed
TargetD(3) dopamine receptor(Rattus norvegicus (Rat))
Columbia University College Of Physicians And Surgeons
Curated by ChEMBL
LigandPNGBDBM50099892(3-[4-(4-Methylsulfanyl-phenyl)-piperazin-1-ylmethy...)
Affinity DataKi:  46nM. Assay description: In vitro binding affinity to cloned rat Dopamine receptor D3 measured by displacement of the radioligand [3H]-sulpiride
In DepthDetails ArticlePubMed
Target5-hydroxytryptamine receptor 7(Homo sapiens (Human))
Columbia University College Of Physicians And Surgeons
Curated by ChEMBL
LigandPNGBDBM50099892(3-[4-(4-Methylsulfanyl-phenyl)-piperazin-1-ylmethy...)
Affinity DataKi:  336nM. Assay description: In vitro binding affinity to human 5-hydroxytryptamine 7 receptor
In DepthDetails ArticlePubMed
Target5-hydroxytryptamine receptor 5A(Homo sapiens (Human))
Columbia University College Of Physicians And Surgeons
Curated by ChEMBL
LigandPNGBDBM50099892(3-[4-(4-Methylsulfanyl-phenyl)-piperazin-1-ylmethy...)
Affinity DataKi: >1.00E+4nM. Assay description: Binding affinity to cloned human 5-hydroxytryptamine 5A receptor
In DepthDetails ArticlePubMed
TargetMu-type opioid receptor(Homo sapiens (Human))
Columbia University College Of Physicians And Surgeons
Curated by ChEMBL
LigandPNGBDBM50099892(3-[4-(4-Methylsulfanyl-phenyl)-piperazin-1-ylmethy...)
Affinity DataKi: >1.00E+4nM. Assay description: Binding affinity to cloned Opioid receptor mu 1
In DepthDetails ArticlePubMed
Target5-hydroxytryptamine receptor 2A(Homo sapiens (Human))
Columbia University College Of Physicians And Surgeons
Curated by ChEMBL
LigandPNGBDBM50099892(3-[4-(4-Methylsulfanyl-phenyl)-piperazin-1-ylmethy...)
Affinity DataKi: >1.00E+4nM. Assay description: Binding affinity to cloned human 5-hydroxytryptamine 2A receptor
In DepthDetails ArticlePubMed
TargetHistamine H1 receptor(Homo sapiens (Human))
Columbia University College Of Physicians And Surgeons
Curated by ChEMBL
LigandPNGBDBM50099892(3-[4-(4-Methylsulfanyl-phenyl)-piperazin-1-ylmethy...)
Affinity DataKi: >1.00E+4nM. Assay description: Binding affinity to cloned Histamine H1 receptor
In DepthDetails ArticlePubMed
TargetMuscarinic acetylcholine receptor M4(Homo sapiens (Human))
Columbia University College Of Physicians And Surgeons
Curated by ChEMBL
LigandPNGBDBM50099892(3-[4-(4-Methylsulfanyl-phenyl)-piperazin-1-ylmethy...)
Affinity DataKi: >1.00E+4nM. Assay description: Binding affinity to cloned Muscarinic acetylcholine receptor M4
In DepthDetails ArticlePubMed
TargetD(2) dopamine receptor(Rattus norvegicus (rat))
Columbia University College Of Physicians And Surgeons
Curated by ChEMBL
LigandPNGBDBM50099892(3-[4-(4-Methylsulfanyl-phenyl)-piperazin-1-ylmethy...)
Affinity DataKi: >1.00E+4nM. Assay description: In vitro binding affinity to rat Dopamine receptor D2 measured by displacement of the radioligand [3H]-spiperone
In DepthDetails ArticlePubMed
Target5-hydroxytryptamine receptor 1D(Homo sapiens (Human))
Columbia University College Of Physicians And Surgeons
Curated by ChEMBL
LigandPNGBDBM50099892(3-[4-(4-Methylsulfanyl-phenyl)-piperazin-1-ylmethy...)
Affinity DataKi: >1.00E+4nM. Assay description: In vitro binding affinity to human 5-hydroxytryptamine 1D receptor
In DepthDetails ArticlePubMed
Target5-hydroxytryptamine receptor 1B(Homo sapiens (Human))
Columbia University College Of Physicians And Surgeons
Curated by ChEMBL
LigandPNGBDBM50099892(3-[4-(4-Methylsulfanyl-phenyl)-piperazin-1-ylmethy...)
Affinity DataKi: >1.00E+4nM. Assay description: Binding affinity to cloned human 5-hydroxytryptamine 1B receptor
In DepthDetails ArticlePubMed
Target5-hydroxytryptamine receptor 6(Homo sapiens (Human))
Columbia University College Of Physicians And Surgeons
Curated by ChEMBL
LigandPNGBDBM50099892(3-[4-(4-Methylsulfanyl-phenyl)-piperazin-1-ylmethy...)
Affinity DataKi: >1.00E+4nM. Assay description: In vitro binding affinity to human 5-hydroxytryptamine 6 receptor
In DepthDetails ArticlePubMed
TargetMuscarinic acetylcholine receptor M3(Homo sapiens (Human))
Columbia University College Of Physicians And Surgeons
Curated by ChEMBL
LigandPNGBDBM50099892(3-[4-(4-Methylsulfanyl-phenyl)-piperazin-1-ylmethy...)
Affinity DataKi: >1.00E+4nM. Assay description: Binding affinity to cloned Muscarinic acetylcholine receptor M3
In DepthDetails ArticlePubMed
TargetD(1A) dopamine receptor(RAT)
Columbia University College Of Physicians And Surgeons
Curated by ChEMBL
LigandPNGBDBM50099892(3-[4-(4-Methylsulfanyl-phenyl)-piperazin-1-ylmethy...)
Affinity DataKi: >1.00E+4nM. Assay description: In vitro binding affinity to cloned rat Dopamine receptor D1 measured by displacement of radioligand [3H]-SCH-23,982
In DepthDetails ArticlePubMed
Target5-hydroxytryptamine receptor 2C(Homo sapiens (Human))
Columbia University College Of Physicians And Surgeons
Curated by ChEMBL
LigandPNGBDBM50099892(3-[4-(4-Methylsulfanyl-phenyl)-piperazin-1-ylmethy...)
Affinity DataKi: >1.00E+4nM. Assay description: Binding affinity to cloned human 5-hydroxytryptamine 2C receptor
In DepthDetails ArticlePubMed
TargetKappa-type opioid receptor(Homo sapiens (Human))
Columbia University College Of Physicians And Surgeons
Curated by ChEMBL
LigandPNGBDBM50099892(3-[4-(4-Methylsulfanyl-phenyl)-piperazin-1-ylmethy...)
Affinity DataKi: >1.00E+4nM. Assay description: Binding affinity of the compound to cloned Opioid receptor kappa 1
In DepthDetails ArticlePubMed
TargetMuscarinic acetylcholine receptor M5(Homo sapiens (Human))
Columbia University College Of Physicians And Surgeons
Curated by ChEMBL
LigandPNGBDBM50099892(3-[4-(4-Methylsulfanyl-phenyl)-piperazin-1-ylmethy...)
Affinity DataKi: >1.00E+4nM. Assay description: Binding affinity to cloned Muscarinic acetylcholine receptor M5
In DepthDetails ArticlePubMed
TargetD(1B) dopamine receptor(RAT)
Columbia University College Of Physicians And Surgeons
Curated by ChEMBL
LigandPNGBDBM50099892(3-[4-(4-Methylsulfanyl-phenyl)-piperazin-1-ylmethy...)
Affinity DataKi: >1.00E+4nM. Assay description: In vitro binding affinity to cloned rat D5 receptor measured by displacement of radioligand [3H]-SCH-23,982
In DepthDetails ArticlePubMed
TargetMuscarinic acetylcholine receptor M2(Homo sapiens (Human))
Columbia University College Of Physicians And Surgeons
Curated by ChEMBL
LigandPNGBDBM50099892(3-[4-(4-Methylsulfanyl-phenyl)-piperazin-1-ylmethy...)
Affinity DataKi: >1.00E+4nM. Assay description: Binding affinity to cloned Muscarinic acetylcholine receptor M1
In DepthDetails ArticlePubMed
Target5-hydroxytryptamine receptor 1E(Homo sapiens (Human))
Columbia University College Of Physicians And Surgeons
Curated by ChEMBL
LigandPNGBDBM50099892(3-[4-(4-Methylsulfanyl-phenyl)-piperazin-1-ylmethy...)
Affinity DataKi: >1.00E+4nM. Assay description: Binding affinity to cloned human 5-hydroxytryptamine 1E receptor
In DepthDetails ArticlePubMed
TargetMuscarinic acetylcholine receptor M2(Homo sapiens (Human))
Columbia University College Of Physicians And Surgeons
Curated by ChEMBL
LigandPNGBDBM50099892(3-[4-(4-Methylsulfanyl-phenyl)-piperazin-1-ylmethy...)
Affinity DataKi: >1.00E+4nM. Assay description: Binding affinity to cloned Muscarinic acetylcholine receptor M1
In DepthDetails ArticlePubMed
TargetDelta-type opioid receptor(Homo sapiens (Human))
Columbia University College Of Physicians And Surgeons
Curated by ChEMBL
LigandPNGBDBM50099892(3-[4-(4-Methylsulfanyl-phenyl)-piperazin-1-ylmethy...)
Affinity DataKi: >1.00E+4nM. Assay description: Binding affinity to cloned Opioid receptor delta 1
In DepthDetails ArticlePubMed
Target5-hydroxytryptamine receptor 1A(Homo sapiens (Human))
Columbia University College Of Physicians And Surgeons
Curated by ChEMBL
LigandPNGBDBM50099892(3-[4-(4-Methylsulfanyl-phenyl)-piperazin-1-ylmethy...)
Affinity DataKi: >1.00E+4nM. Assay description: In vitro binding affinity to human 5-hydroxytryptamine 1A receptor
In DepthDetails ArticlePubMed