BDBM50100026 (S)-2-Benzoylamino-4-phenyl-butyric acid ethyl ester::CHEMBL32413
SMILES CCOC(=O)[C@H](CCc1ccccc1)NC(=O)c1ccccc1
InChI Key InChIKey=BBGVYTQLRUAOLT-KRWDZBQOSA-N
Data  1 IC50
  Tab Delimited (TSV)   2D SDfile   Computed 3D by Vconf -m prep SDfile
Find this compound or compounds like it in BindingDB:
Activity Spreadsheet -- Enzyme Inhibition Constant Data from BindingDB
Found 1 hit for monomerid = 50100026
TargetC-C chemokine receptor type 3(Homo sapiens (Human))
Smithkline Beecham Pharmaceuticals
Curated by ChEMBL
LigandPNGBDBM50100026((S)-2-Benzoylamino-4-phenyl-butyric acid ethyl est...)
Affinity DataIC50:  5.95E+3nM. Assay description: Inhibitory activity against human eosinophil C-C chemokine receptor type 3 using [125I]- human eotaxin as the radioligand
In DepthDetails ArticlePubMed