BDBM50100202 3-[2-(6-Methoxy-1,3,3a,4,5,9b-hexahydro-benzo[e]isoindol-2-yl)-ethyl]-6,8-dimethyl-1H-quinazoline-2,4-dione::CHEMBL291769
SMILES COc1cccc2[C@@H]3CN(CCn4c(=O)[nH]c5c(C)cc(C)cc5c4=O)C[C@@H]3CCc12
InChI Key InChIKey=DZVKSRJUFFUHHJ-LAUBAEHRSA-N
Data  3 KI
  Tab Delimited (TSV)   2D SDfile   Computed 3D by Vconf -m prep SDfile
Find this compound or compounds like it in BindingDB:
Activity Spreadsheet -- Enzyme Inhibition Constant Data from BindingDB
Found 3 hits for monomerid = 50100202
TargetAlpha-1A adrenergic receptor(Rattus norvegicus (Rat))
Abbott Laboratories
Curated by ChEMBL
LigandPNGBDBM50100202(3-[2-(6-Methoxy-1,3,3a,4,5,9b-hexahydro-benzo[e]is...)
Affinity DataKi:  2.73nM. Assay description: Binding affinity to alpha-1A adrenergic receptor in rat submaxillary gland
In DepthDetails ArticlePubMed
TargetAlpha-1D adrenergic receptor(Rattus norvegicus (Rat))
Abbott Laboratories
Curated by ChEMBL
LigandPNGBDBM50100202(3-[2-(6-Methoxy-1,3,3a,4,5,9b-hexahydro-benzo[e]is...)
Affinity DataKi:  2.86nM. Assay description: Binding affinity of the compound to rat alpha-1D adrenergic receptor expressed in LTK cells
In DepthDetails ArticlePubMed
TargetAlpha-1B adrenergic receptor(Homo sapiens (Human))
Abbott Laboratories
Curated by ChEMBL
LigandPNGBDBM50100202(3-[2-(6-Methoxy-1,3,3a,4,5,9b-hexahydro-benzo[e]is...)
Affinity DataKi:  16.3nM. Assay description: Binding affinity to hamster alpha-1B adrenergic receptor
In DepthDetails ArticlePubMed