BDBM50100264 CHEMBL3325898
SMILES CCCC(=O)c1cnn(c1C)-c1ccc(NC(=O)c2cn(CC(=O)N3CCN(C)CC3)c3ccc(Cl)cc23)c(c1)C(N)=O
InChI Key InChIKey=NGVGPDQUAMGXTG-UHFFFAOYSA-N
Data  2 IC50
  Tab Delimited (TSV)   2D SDfile   Computed 3D by Vconf -m prep SDfile
Find this compound or compounds like it in BindingDB:
Activity Spreadsheet -- Enzyme Inhibition Constant Data from BindingDB
Found 2 hits for monomerid = 50100264
TargetP2Y purinoceptor 12(Rattus norvegicus)
Sanofi R & D
Curated by ChEMBL
LigandPNGBDBM50100264(CHEMBL3325898)
Affinity DataIC50:  1.50E+3nM. Assay description: Antagonist activity at P2Y12 receptor in Sprague-Dawley rat platelet rich plasma assessed as inhibition of ADP-induced aggregation
In DepthDetails ArticlePubMed
TargetP2Y purinoceptor 12(Homo sapiens (Human))
Sanofi R & D
Curated by ChEMBL
LigandPNGBDBM50100264(CHEMBL3325898)
Affinity DataIC50:  266nM. Assay description: Antagonist activity at P2Y12 receptor in Sprague-Dawley rat platelet rich plasma assessed as inhibition of ADP-induced aggregation
In DepthDetails ArticlePubMed