BDBM50100532 CHEMBL3327076
SMILES CCC(C)C(=O)N1CCC(CC1)NC(=O)NC1CCCCCC1
InChI Key InChIKey=KIFXYZAYVCHLJB-UHFFFAOYSA-N
Data  1 KI
  Tab Delimited (TSV)   2D SDfile   Computed 3D by Vconf -m prep SDfile
Find this compound or compounds like it in BindingDB:
Activity Spreadsheet -- Enzyme Inhibition Constant Data from BindingDB
Found 1 hit for monomerid = 50100532
TargetBifunctional epoxide hydrolase 2(Homo sapiens (Human))
University Of California Davis
Curated by ChEMBL
LigandPNGBDBM50100532(CHEMBL3327076)
Affinity DataKi:  0.990nM. Assay description: Inhibition of human recombinant soluble epoxide hydrolase by FRET-based ACPU displacement assay
In DepthDetails ArticlePubMed