BDBM50100533 CHEMBL3327075
SMILES CCC(C)C(=O)N1CCC(CC1)NC(=O)NC1CCCCC1
InChI Key InChIKey=KOQQKBMWPPGUQF-UHFFFAOYSA-N
Data  1 KI
  Tab Delimited (TSV)   2D SDfile   Computed 3D by Vconf -m prep SDfile
Find this compound or compounds like it in BindingDB:
Activity Spreadsheet -- Enzyme Inhibition Constant Data from BindingDB
Found 1 hit for monomerid = 50100533
TargetBifunctional epoxide hydrolase 2(Homo sapiens (Human))
University Of California Davis
Curated by ChEMBL
LigandPNGBDBM50100533(CHEMBL3327075)
Affinity DataKi:  1.20nM. Assay description: Inhibition of human recombinant soluble epoxide hydrolase by FRET-based ACPU displacement assay
In DepthDetails ArticlePubMed