BDBM50100594 CHEMBL3321874
SMILES COc1cc(ccc1OC(=O)N(C)C)C(C)N1CCCC1
InChI Key InChIKey=ZAKCDAWJOGMECL-UHFFFAOYSA-N
Data  2 IC50
  Tab Delimited (TSV)   2D SDfile   Computed 3D by Vconf -m prep SDfile
Find this compound or compounds like it in BindingDB:
Activity Spreadsheet -- Enzyme Inhibition Constant Data from BindingDB
Found 2 hits for monomerid = 50100594
TargetAcetylcholinesterase(Rattus norvegicus (rat))
Zhejiang University
Curated by ChEMBL
LigandPNGBDBM50100594(CHEMBL3321874)
Affinity DataIC50:  190nM. Assay description: Inhibition of AChE in rat cortex homogenates using acetylthiocholine iodide substrate incubated for 15 mins by UV spectroscopy based Ellman's method
In DepthDetails ArticlePubMed
TargetCarboxylic ester hydrolase(Rattus norvegicus (rat))
Zhejiang University
Curated by ChEMBL
LigandPNGBDBM50100594(CHEMBL3321874)
Affinity DataIC50:  18nM. Assay description: Inhibition of BChE in rat serum using butyrylthiocholine iodide substrate incubated for 15 mins by UV spectroscopy based Ellman's method
In DepthDetails ArticlePubMed