BDBM50100614 CHEMBL3321892
SMILES N(c1ccc2nc([nH]c2c1)-c1ccccc1)c1ncnc2ccccc12
InChI Key InChIKey=WZHBBBJODHDMJN-UHFFFAOYSA-N
Data  2 IC50
  Tab Delimited (TSV)   2D SDfile   Computed 3D by Vconf -m prep SDfile
Find this compound or compounds like it in BindingDB:
Activity Spreadsheet -- Enzyme Inhibition Constant Data from BindingDB
Found 2 hits for monomerid = 50100614
TargetHepatocyte growth factor receptor(Homo sapiens (Human))
China Pharmaceutical University
Curated by ChEMBL
LigandPNGBDBM50100614(CHEMBL3321892)
Affinity DataIC50:  1.34E+3nM. Assay description: Inhibition of human recombinant c-Met pre-incubated for 5 mins before ATP/substrate peptide cocktail addition measured after 30 mins by colorimetric ...
In DepthDetails ArticlePubMed
TargetVascular endothelial growth factor receptor 2(Homo sapiens (Human))
China Pharmaceutical University
Curated by ChEMBL
LigandPNGBDBM50100614(CHEMBL3321892)
Affinity DataIC50:  830nM. Assay description: Inhibition of human recombinant VEGFR2 pre-incubated for 5 mins before ATP/substrate peptide cocktail addition measured after 30 mins by colorimetric...
In DepthDetails ArticlePubMed