BDBM50100741 CHEMBL413378::Des-AA1,2,5-[Phe7(4NO2),D2Nal8,IAmp9]-SRIF
SMILES CC(C)NCc1ccc(C[C@@H]2NC(=O)[C@@H](Cc3ccc4ccccc4c3)NC(=O)[C@H](Cc3ccc(cc3)[N+]([O-])=O)NC(=O)[C@@H](Cc3ccccc3)NC(=O)[C@@H](CCCCN)NC(=O)[C@H](N)CSSC[C@H](NC(=O)[C@H](CO)NC(=O)[C@H](NC(=O)[C@H](Cc3ccccc3)NC(=O)[C@H](NC2=O)[C@@H](C)O)[C@@H](C)O)C(O)=O)cc1
InChI Key InChIKey=FUOUCIQUILKEFM-VYMISZHVSA-N
Data  5 IC50
  Tab Delimited (TSV)   2D SDfile   Computed 3D by Vconf -m prep SDfile
Find this compound or compounds like it in BindingDB:
Activity Spreadsheet -- Enzyme Inhibition Constant Data from BindingDB
Found 5 hits for monomerid = 50100741
TargetSomatostatin receptor type 2(Homo sapiens (Human))
Salk Institute
Curated by ChEMBL
LigandPNGBDBM50100741(CHEMBL413378 | Des-AA1,2,5-[Phe7(4NO2),D2Nal8,IAmp...)
Affinity DataIC50: >1.00E+3nM. Assay description: Tested for ability to bind to 20 microM thick cryostat sections of a membrane pellet of cells transfected with human cloned somatostatin (sst) recept...
In DepthDetails ArticlePubMed
TargetSomatostatin receptor type 1(Homo sapiens (Human))
Salk Institute
Curated by ChEMBL
LigandPNGBDBM50100741(CHEMBL413378 | Des-AA1,2,5-[Phe7(4NO2),D2Nal8,IAmp...)
Affinity DataIC50:  35nM. Assay description: Tested for ability to bind to 20 microM thick cryostat sections of a membrane pellet of cells transfected with human cloned somatostatin (sst) recept...
In DepthDetails ArticlePubMed
TargetSomatostatin receptor type 4(Homo sapiens (Human))
Salk Institute
Curated by ChEMBL
LigandPNGBDBM50100741(CHEMBL413378 | Des-AA1,2,5-[Phe7(4NO2),D2Nal8,IAmp...)
Affinity DataIC50: >1.00E+3nM. Assay description: Tested for ability to bind to 20 microM thick cryostat sections of a membrane pellet of cells transfected with human cloned somatostatin (sst) recept...
In DepthDetails ArticlePubMed
TargetSomatostatin receptor type 5(Homo sapiens (Human))
Salk Institute
Curated by ChEMBL
LigandPNGBDBM50100741(CHEMBL413378 | Des-AA1,2,5-[Phe7(4NO2),D2Nal8,IAmp...)
Affinity DataIC50: >1.00E+3nM. Assay description: Tested for ability to bind to 20 microM thick cryostat sections of a membrane pellet of cells transfected with human cloned somatostatin (sst) recept...
In DepthDetails ArticlePubMed
TargetSomatostatin receptor type 3(Homo sapiens (Human))
Salk Institute
Curated by ChEMBL
LigandPNGBDBM50100741(CHEMBL413378 | Des-AA1,2,5-[Phe7(4NO2),D2Nal8,IAmp...)
Affinity DataIC50:  975nM. Assay description: Tested for ability to bind to 20 microM thick cryostat sections of a membrane pellet of cells transfected with human cloned somatostatin (sst) recept...
In DepthDetails ArticlePubMed