BDBM50101014 CHEMBL297408::{[(1-Carbamimidoyl-piperidin-4-ylmethyl)-carbamoyl]-methyl}-carbamic acid 4-{[(1-carbamimidoyl-piperidin-4-ylmethyl)-carbamoyl]-methylcarbamoyloxymethyl}-benzyl ester
SMILES NC(=N)N1CCC(CNC(=O)CNC(=O)OCc2ccc(COC(=O)NCC(=O)NCC3CCN(CC3)C(N)=N)cc2)CC1
InChI Key InChIKey=NLDZDRVLDYNPMO-UHFFFAOYSA-N
Data  4 KI
  Tab Delimited (TSV)   2D SDfile   Computed 3D by Vconf -m prep SDfile
Find this compound or compounds like it in BindingDB:
Activity Spreadsheet -- Enzyme Inhibition Constant Data from BindingDB
Found 4 hits for monomerid = 50101014
TargetTryptase beta-2/delta/gamma(Homo sapiens (Human))
Axys Pharmaceuticals
Curated by ChEMBL
LigandPNGBDBM50101014(CHEMBL297408 | {[(1-Carbamimidoyl-piperidin-4-ylme...)
Affinity DataKi:  155nM. Assay description: Inhibition of trypsin in human mast cells
In DepthDetails ArticlePubMed
TargetProthrombin(Homo sapiens (Human))
Axys Pharmaceuticals
Curated by ChEMBL
LigandPNGBDBM50101014(CHEMBL297408 | {[(1-Carbamimidoyl-piperidin-4-ylme...)
Affinity DataKi:  3.86E+5nM. Assay description: Inhibition of thrombin in human mast cells
In DepthDetails ArticlePubMed
TargetTrypsin(Homo sapiens (Human))
Axys Pharmaceuticals
Curated by ChEMBL
LigandPNGBDBM50101014(CHEMBL297408 | {[(1-Carbamimidoyl-piperidin-4-ylme...)
Affinity DataKi:  4.66E+5nM. Assay description: Binding affinity to 5-HT3 serotonin receptor in NG 108-15 neuroblastoma glioma cells using [3H]-GR-65,630 radioligand.
In DepthDetails ArticlePubMed
TargetPlasminogen(Homo sapiens (Human))
Axys Pharmaceuticals
Curated by ChEMBL
LigandPNGBDBM50101014(CHEMBL297408 | {[(1-Carbamimidoyl-piperidin-4-ylme...)
Affinity DataKi: >1.00E+6nM. Assay description: Inhibition plasmin in human mast cells
In DepthDetails ArticlePubMed