BDBM50101371 3-(4-Chloro-3-sulfamoyl-benzoylamino)-propionic acid::CHEMBL48697
SMILES NS(=O)(=O)c1cc(ccc1Cl)C(=O)NCCC(O)=O
InChI Key InChIKey=JKAQBWOSNXZORA-UHFFFAOYSA-N
Data  3 KI
  Tab Delimited (TSV)   2D SDfile   Computed 3D by Vconf -m prep SDfile
Find this compound or compounds like it in BindingDB:
Activity Spreadsheet -- Enzyme Inhibition Constant Data from BindingDB
Found 3 hits for monomerid = 50101371
TargetCarbonic anhydrase 1(Homo sapiens (Human))
Universit£
Curated by ChEMBL
LigandPNGBDBM50101371(3-(4-Chloro-3-sulfamoyl-benzoylamino)-propionic ac...)
Affinity DataKi:  205nM. Assay description: Binding affinity against human carbonic anhydrase I (hCA I)
In DepthDetails ArticlePubMed
TargetCarbonic anhydrase 2(Homo sapiens (Human))
Universit£
Curated by ChEMBL
LigandPNGBDBM50101371(3-(4-Chloro-3-sulfamoyl-benzoylamino)-propionic ac...)
Affinity DataKi:  450nM. Assay description: Binding affinity against human carbonic anhydrase II (hCA -II)
In DepthDetails ArticlePubMed
TargetCarbonic anhydrase 4(Bos taurus (bovine))
Universit£
Curated by ChEMBL
LigandPNGBDBM50101371(3-(4-Chloro-3-sulfamoyl-benzoylamino)-propionic ac...)
Affinity DataKi:  610nM. Assay description: Compound was evaluated for binding affinity against bovine carbonic anhydrase IV (bCA IV)
In DepthDetails ArticlePubMed