BDBM50101535 1-(2-Hydroxy-1-methyl-2-phenyl-ethyl)-1-methyl-3-(2-phenoxy-phenyl)-urea::CHEMBL76853
SMILES C[C@H]([C@@H](O)c1ccccc1)N(C)C(=O)Nc1ccccc1Oc1ccccc1
InChI Key InChIKey=MIEVMPNEMWEUNM-VGOFRKELSA-N
Data  1 IC50
  Tab Delimited (TSV)   2D SDfile   Computed 3D by Vconf -m prep SDfile
Find this compound or compounds like it in BindingDB:
Activity Spreadsheet -- Enzyme Inhibition Constant Data from BindingDB
Found 1 hit for monomerid = 50101535
TargetNeuropeptide Y receptor type 5(Homo sapiens (Human))
Amgen
Curated by ChEMBL
LigandPNGBDBM50101535(1-(2-Hydroxy-1-methyl-2-phenyl-ethyl)-1-methyl-3-(...)
Affinity DataIC50: >1.00E+4nM. Assay description: Inhibitory activity tested against Human Neuropeptide Y5 Receptor.
In DepthDetails ArticlePubMed