BDBM50101782 4-Nitro-N-(4-phenyl-thiazol-2-yl)-benzamide::CHEMBL60027
SMILES [O-][N+](=O)c1ccc(cc1)C(=O)Nc1nc(cs1)-c1ccccc1
InChI Key InChIKey=LLSUVHOZHQEGJS-UHFFFAOYSA-N
Data  1 KI
  Tab Delimited (TSV)   2D SDfile   Computed 3D by Vconf -m prep SDfile
Find this compound or compounds like it in BindingDB:
Activity Spreadsheet -- Enzyme Inhibition Constant Data from BindingDB
Found 1 hit for monomerid = 50101782
TargetAdenosine receptor A1(Rattus norvegicus (rat))
Leiden/Amsterdam Center For Drug Research
Curated by ChEMBL
LigandPNGBDBM50101782(4-Nitro-N-(4-phenyl-thiazol-2-yl)-benzamide | CHEM...)
Affinity DataKi:  22nM. Assay description: Displacement of [3H]-DPCPX from Adenosine A1 receptor of rat cortical membrane
In DepthDetails ArticlePubMed