BDBM50101785 4-tert-Butyl-N-(4-phenyl-thiazol-2-yl)-benzamide::CHEMBL293635
SMILES CC(C)(C)c1ccc(cc1)C(=O)Nc1nc(cs1)-c1ccccc1
InChI Key InChIKey=JXOGYJOCFUSOPS-UHFFFAOYSA-N
Data  1 KI
  Tab Delimited (TSV)   2D SDfile   Computed 3D by Vconf -m prep SDfile
Find this compound or compounds like it in BindingDB:
Activity Spreadsheet -- Enzyme Inhibition Constant Data from BindingDB
Found 1 hit for monomerid = 50101785
TargetAdenosine receptor A1(Rattus norvegicus (rat))
Leiden/Amsterdam Center For Drug Research
Curated by ChEMBL
LigandPNGBDBM50101785(4-tert-Butyl-N-(4-phenyl-thiazol-2-yl)-benzamide |...)
Affinity DataKi:  1.36E+3nM. Assay description: Displacement of [3H]-DPCPX from Adenosine A1 receptor of rat cortical membrane
In DepthDetails ArticlePubMed