BDBM50101931 15,16-dimethyl-17-oxo-(16R)-2-oxa-9,11,15,18-tetraazapentacyclo[17.6.2.13,7.09,13.023,27]octacosa-1(26),3,5,7(28),10,12,19(27),20,22,24-decaen-4-yl cyanide::CHEMBL54969
SMILES C[C@H]1N(C)Cc2cncn2Cc2ccc(C#N)c(Oc3ccc4cccc(NC1=O)c4c3)c2
InChI Key InChIKey=BAQAZCQBLRUMRU-QGZVFWFLSA-N
Data  3 IC50
  Tab Delimited (TSV)   2D SDfile   Computed 3D by Vconf -m prep SDfile
Find this compound or compounds like it in BindingDB:
Activity Spreadsheet -- Enzyme Inhibition Constant Data from BindingDB
Found 3 hits for monomerid = 50101931
TargetProtein farnesyltransferase subunit beta/geranylgeranyltransferase type-1 subunit alpha(Homo sapiens (Human))
Merck Research Laboratories
Curated by ChEMBL
LigandPNGBDBM50101931(15,16-dimethyl-17-oxo-(16R)-2-oxa-9,11,15,18-tetra...)
Affinity DataIC50:  7nM. Assay description: In vitro inhibitory activity to reduce the human farnesyltransferase catalyzed incorporation of [3H]-FPP into recombinant Ras-CVIM
In DepthDetails ArticlePubMed
LigandPNGBDBM50101931(15,16-dimethyl-17-oxo-(16R)-2-oxa-9,11,15,18-tetra...)
Affinity DataIC50:  1.22E+3nM. Assay description: In vitro inhibitory activity to reduce the human geranylgeranyl transferase type I (GGPTase-1)-catalyzed incorporation of 3H GGPP (100 nM) into K-Ras...
In DepthDetails ArticlePubMed
TargetProtein farnesyltransferase subunit beta/geranylgeranyltransferase type-1 subunit alpha(Rattus norvegicus)
Merck Research Laboratories
Curated by ChEMBL
LigandPNGBDBM50101931(15,16-dimethyl-17-oxo-(16R)-2-oxa-9,11,15,18-tetra...)
Affinity DataIC50: >100nM. Assay description: In vitro ability of the compound to displace radiolabelled FTI from farnesyltransferase in cultured Ha-ras transformed RAT1 cells
In DepthDetails ArticlePubMed