BDBM50102074 (3-Chloro-4-fluoro-phenyl)-[6-(3-diethylamino-propoxy)-7-methoxy-quinazolin-4-yl]-amine::CHEMBL55425
SMILES CCN(CC)CCCOc1cc2c(Nc3ccc(F)c(Cl)c3)ncnc2cc1OC
InChI Key InChIKey=JJKSOLDGGFGXJF-UHFFFAOYSA-N
Data  1 IC50
  Tab Delimited (TSV)   2D SDfile   Computed 3D by Vconf -m prep SDfile
Find this compound or compounds like it in BindingDB:
Activity Spreadsheet -- Enzyme Inhibition Constant Data from BindingDB
Found 1 hit for monomerid = 50102074
TargetEpidermal growth factor receptor(Homo sapiens (Human))
Astrazeneca
Curated by ChEMBL
LigandPNGBDBM50102074((3-Chloro-4-fluoro-phenyl)-[6-(3-diethylamino-prop...)
Affinity DataIC50:  57nM. Assay description: In vitro inhibitory activity against Epidermal growth factor receptor (EGFR-TK) from A431 vulval squamous carcinoma cells using TKI assay
In DepthDetails ArticlePubMed