BDBM50102089 (3-Chloro-4-fluoro-phenyl)-[7-methoxy-6-(2-pyrrolidin-1-yl-ethoxy)-quinazolin-4-yl]-amine::CHEMBL57758
SMILES COc1cc2ncnc(Nc3ccc(F)c(Cl)c3)c2cc1OCCN1CCCC1
InChI Key InChIKey=BLFAAYGECSULMU-UHFFFAOYSA-N
Data  1 IC50
  Tab Delimited (TSV)   2D SDfile   Computed 3D by Vconf -m prep SDfile
Find this compound or compounds like it in BindingDB:
Activity Spreadsheet -- Enzyme Inhibition Constant Data from BindingDB
Found 1 hit for monomerid = 50102089
TargetEpidermal growth factor receptor(Homo sapiens (Human))
Astrazeneca
Curated by ChEMBL
LigandPNGBDBM50102089((3-Chloro-4-fluoro-phenyl)-[7-methoxy-6-(2-pyrroli...)
Affinity DataIC50:  87nM. Assay description: In vitro inhibitory activity against Epidermal growth factor receptor (EGFR-TK) from A431 vulval squamous carcinoma cells using TKI assay
In DepthDetails ArticlePubMed