BDBM50102245 4-(2-Chloro-phenyl)-1-[3-(2,5-dioxo-3,3-di-p-tolyl-pyrrolidin-1-yl)-propyl]-piperidine-4-carbonitrile::CHEMBL62045
SMILES Cc1ccc(cc1)C1(CC(=O)N(CCCN2CCC(CC2)(C#N)c2ccccc2Cl)C1=O)c1ccc(C)cc1
InChI Key InChIKey=LDEQSIYHAXUIBH-UHFFFAOYSA-N
Data  3 KI
  Tab Delimited (TSV)   2D SDfile   Computed 3D by Vconf -m prep SDfile
Find this compound or compounds like it in BindingDB:
Activity Spreadsheet -- Enzyme Inhibition Constant Data from BindingDB
Found 3 hits for monomerid = 50102245
TargetAlpha-1A adrenergic receptor(Homo sapiens (Human))
Merck
Curated by ChEMBL
LigandPNGBDBM50102245(4-(2-Chloro-phenyl)-1-[3-(2,5-dioxo-3,3-di-p-tolyl...)
Affinity DataKi:  0.480nM. Assay description: In vitro binding affinity towards cloned human Alpha-1A adrenergic receptor
In DepthDetails ArticlePubMed
TargetAlpha-1B adrenergic receptor(Homo sapiens (Human))
Merck
Curated by ChEMBL
LigandPNGBDBM50102245(4-(2-Chloro-phenyl)-1-[3-(2,5-dioxo-3,3-di-p-tolyl...)
Affinity DataKi:  98nM. Assay description: In vitro binding affinity towards cloned human Alpha-1B adrenergic receptor
In DepthDetails ArticlePubMed
TargetAlpha-1D adrenergic receptor(Homo sapiens (Human))
Merck
Curated by ChEMBL
LigandPNGBDBM50102245(4-(2-Chloro-phenyl)-1-[3-(2,5-dioxo-3,3-di-p-tolyl...)
Affinity DataKi:  220nM. Assay description: In vitro binding affinity towards cloned human Alpha-1D adrenergic receptor
In DepthDetails ArticlePubMed