BDBM50102287 3-furan-2-yl-10-phenyl-10H-benzo[4,5]imidazo[2,1-c][1,2,4]triazin-4-one::CHEMBL324100
SMILES O=c1c(nnc2n(-c3ccccc3)c3ccccc3n12)-c1ccco1
InChI Key InChIKey=AWLXMIOPONXPFQ-UHFFFAOYSA-N
Data  4 KI  1 IC50
  Tab Delimited (TSV)   2D SDfile   Computed 3D by Vconf -m prep SDfile
Find this compound or compounds like it in BindingDB:
Activity Spreadsheet -- Enzyme Inhibition Constant Data from BindingDB
Found 5 hits for monomerid = 50102287
TargetAdenosine receptor A1(BOVINE)
Universit£
Curated by ChEMBL
LigandPNGBDBM50102287(3-furan-2-yl-10-phenyl-10H-benzo[4,5]imidazo[2,1-c...)
Affinity DataKi:  315nM. Assay description: Displacement of [3H]CHA from adenosine A1 receptors was determined in bovine cortical membranes
In DepthDetails ArticlePubMed
TargetAdenosine receptor A2a(Homo sapiens (Human))
Universit£
Curated by ChEMBL
LigandPNGBDBM50102287(3-furan-2-yl-10-phenyl-10H-benzo[4,5]imidazo[2,1-c...)
Affinity DataKi:  3.28E+3nM. Assay description: Displacement of [3H]NECA from human A2A adenosine receptor expressed in CHO cell membrane
In DepthDetails ArticlePubMed
TargetAdenosine receptor A3(Homo sapiens (Human))
Universit£
Curated by ChEMBL
LigandPNGBDBM50102287(3-furan-2-yl-10-phenyl-10H-benzo[4,5]imidazo[2,1-c...)
Affinity DataKi: >1.00E+4nM. Assay description: Displacement of [125I]AB-MECA from human A3 adenosine receptor expressed in CHO cell membrane
In DepthDetails ArticlePubMed
TargetAdenosine receptor A1(Homo sapiens (Human))
Universit£
Curated by ChEMBL
LigandPNGBDBM50102287(3-furan-2-yl-10-phenyl-10H-benzo[4,5]imidazo[2,1-c...)
Affinity DataKi: >1.00E+4nM. Assay description: Displacement of [3H]DPCPX from human A1 adenosine receptor expressed in CHO cell membrane
In DepthDetails ArticlePubMed
TargetAdenosine receptor A2b(Homo sapiens (Human))
Universit£
Curated by ChEMBL
LigandPNGBDBM50102287(3-furan-2-yl-10-phenyl-10H-benzo[4,5]imidazo[2,1-c...)
Affinity DataIC50:  3.20E+3nM. Assay description: Antagonist activity at human A2B receptor expressed in CHO cells assessed as inhibition of NECA-mediated cAMP accumulation
In DepthDetails ArticlePubMed