BDBM50102318 2-{2-[4-(5,5-Dioxo-5H-5lambda*6*-dibenzo[b,f][1,4]thiazepin-11-yl)-piperazin-1-yl]-ethoxy}-ethanol::CHEMBL126526
SMILES OCCOCCN1CCN(CC1)C1=Nc2ccccc2S(=O)(=O)c2ccccc12
InChI Key InChIKey=SQUTWXZEWJNIQN-UHFFFAOYSA-N
Data  1 IC50
  Tab Delimited (TSV)   2D SDfile   Computed 3D by Vconf -m prep SDfile
Find this compound or compounds like it in BindingDB:
Activity Spreadsheet -- Enzyme Inhibition Constant Data from BindingDB
Found 1 hit for monomerid = 50102318
TargetD(2) dopamine receptor(Rattus norvegicus (rat))
Astrazeneca Pharmaceuticals
Curated by ChEMBL
LigandPNGBDBM50102318(2-{2-[4-(5,5-Dioxo-5H-5lambda*6*-dibenzo[b,f][1,4]...)
Affinity DataIC50:  132nM. Assay description: Inhibition of spiropiperidone binding at dopamine receptor D2 of rat.
In DepthDetails ArticlePubMed