BDBM50102334 3-(4-(4-nitrophenyl)piperazin-1-yl)-1-phenylpropan-1-ol::3-[4-(4-Nitro-phenyl)-piperazin-1-yl]-1-phenyl-propan-1-ol::CHEMBL137178
SMILES OC(CCN1CCN(CC1)c1ccc(cc1)[N+]([O-])=O)c1ccccc1
InChI Key InChIKey=DCVWTZSLJPJYFB-UHFFFAOYSA-N
Data  4 KI
  Tab Delimited (TSV)   2D SDfile   Computed 3D by Vconf -m prep SDfile
Find this compound or compounds like it in BindingDB:
Activity Spreadsheet -- Enzyme Inhibition Constant Data from BindingDB
Found 4 hits for monomerid = 50102334
TargetSodium-dependent serotonin transporter(Rattus norvegicus (rat))
Universidad De Navarra
Curated by ChEMBL
LigandPNGBDBM50102334(3-(4-(4-nitrophenyl)piperazin-1-yl)-1-phenylpropan...)
Affinity DataKi:  1.15E+3nM. Assay description: Binding affinity towards Serotonin transporter from rat cortex measured using [3H]-paroxetine
In DepthDetails ArticlePubMed
Target5-hydroxytryptamine receptor 1A(Rattus norvegicus (rat))
Universidad De Navarra
Curated by ChEMBL
LigandPNGBDBM50102334(3-(4-(4-nitrophenyl)piperazin-1-yl)-1-phenylpropan...)
Affinity DataKi: >5.00E+3nM. Assay description: Binding affinity to 5-hydroxytryptamine 1A receptor (5-HT 1A receptor, serotonin receptor) from rat cortex using [3H]-8-OH-DPAT as radioligand
In DepthDetails ArticlePubMed
Target5-hydroxytryptamine receptor 1A(Homo sapiens (Human))
Universidade De S£O Paulo
Curated by ChEMBL
LigandPNGBDBM50102334(3-(4-(4-nitrophenyl)piperazin-1-yl)-1-phenylpropan...)
Affinity DataKi:  5.01E+3nM. Assay description: Binding affinity to 5HT1A receptor
In DepthDetails ArticlePubMed
Target5-hydroxytryptamine receptor 1A(Homo sapiens (Human))
Universidade De S£O Paulo
Curated by ChEMBL
LigandPNGBDBM50102334(3-(4-(4-nitrophenyl)piperazin-1-yl)-1-phenylpropan...)
Affinity DataKi:  5.01E+3nM. Assay description: Antagonist activity at 5HT1A
In DepthDetails ArticlePubMed