BDBM50102386 1-(2,5-Dimethyl-thiophen-3-yl)-3-[4-(4-fluoro-2-methoxy-phenyl)-piperazin-1-yl]-propan-1-one::1-(2,5-dimethylthiophen-3-yl)-3-(4-(4-fluoro-2-methoxyphenyl)piperazin-1-yl)propan-1-one::CHEMBL341381
SMILES COc1cc(F)ccc1N1CCN(CCC(=O)c2cc(C)sc2C)CC1
InChI Key InChIKey=GHCHMYSZZHTHJD-UHFFFAOYSA-N
Data  3 KI
  Tab Delimited (TSV)   2D SDfile   Computed 3D by Vconf -m prep SDfile
Find this compound or compounds like it in BindingDB:
Activity Spreadsheet -- Enzyme Inhibition Constant Data from BindingDB
Found 3 hits for monomerid = 50102386
Target5-hydroxytryptamine receptor 1A(Homo sapiens (Human))
Universidade Federal Da Para£Ba
Curated by ChEMBL
LigandPNGBDBM50102386(1-(2,5-Dimethyl-thiophen-3-yl)-3-[4-(4-fluoro-2-me...)
Affinity DataKi:  12.9nM. Assay description: Antagonist activity at 5HT1A
In DepthDetails ArticlePubMed
Target5-hydroxytryptamine receptor 1A(Rattus norvegicus (rat))
Universidad De Navarra
Curated by ChEMBL
LigandPNGBDBM50102386(1-(2,5-Dimethyl-thiophen-3-yl)-3-[4-(4-fluoro-2-me...)
Affinity DataKi:  13nM. Assay description: Binding affinity to 5-hydroxytryptamine 1A receptor (5-HT 1A receptor, serotonin receptor) from rat cortex using [3H]-8-OH-DPAT as radioligand
In DepthDetails ArticlePubMed
TargetSodium-dependent serotonin transporter(Rattus norvegicus (rat))
Universidad De Navarra
Curated by ChEMBL
LigandPNGBDBM50102386(1-(2,5-Dimethyl-thiophen-3-yl)-3-[4-(4-fluoro-2-me...)
Affinity DataKi:  750nM. Assay description: Binding affinity towards Serotonin transporter from rat cortex measured using [3H]-paroxetine
In DepthDetails ArticlePubMed