BDBM50102421 CHEMBL140774::N-Benzyl-5-(2,5-dihydroxy-benzylamino)-2-hydroxy-benzamide
SMILES Oc1ccc(O)c(CNc2ccc(O)c(c2)C(=O)NCc2ccccc2)c1
InChI Key InChIKey=QPNICESGZANARJ-UHFFFAOYSA-N
Data  3 IC50
  Tab Delimited (TSV)   2D SDfile   Computed 3D by Vconf -m prep SDfile
Find this compound or compounds like it in BindingDB:
Activity Spreadsheet -- Enzyme Inhibition Constant Data from BindingDB
Found 3 hits for monomerid = 50102421
TargetTubulin beta-2B chain(Bos taurus)
Purdue University
Curated by ChEMBL
LigandPNGBDBM50102421(CHEMBL140774 | N-Benzyl-5-(2,5-dihydroxy-benzylami...)
Affinity DataIC50:  3.20E+3nM. Assay description: Inhibition of bovine tubulin polymerization
In DepthDetails ArticlePubMed
TargetEpidermal growth factor receptor(Mus musculus)
Purdue University
Curated by ChEMBL
LigandPNGBDBM50102421(CHEMBL140774 | N-Benzyl-5-(2,5-dihydroxy-benzylami...)
Affinity DataIC50:  8.00E+3nM. Assay description: Inhibition of epidermal growth factor receptor phosphorylation in BaF3 mouse lymphoid cells.
In DepthDetails ArticlePubMed
TargetTyrosine-protein kinase SYK(Homo sapiens (Human))
Purdue University
Curated by ChEMBL
LigandPNGBDBM50102421(CHEMBL140774 | N-Benzyl-5-(2,5-dihydroxy-benzylami...)
Affinity DataIC50:  2.50E+4nM. Assay description: In vitro inhibition of Syk protein tyrosine kinase
In DepthDetails ArticlePubMed