BDBM50102448 Ac-D-Nal-[D-(pCl)Phe]-D-Pal-Ser-[Aph(Hor)]-D-[Amf(Cbm)]-Leu-ILys-Pro-Ala-ol::CHEMBL412749
SMILES CC(C)C[C@H](NC(=O)[C@@H](Cc1ccc(CNC(N)=O)cc1)NC(=O)[C@H](Cc1ccc(NC(=O)[C@@H]2CC(=O)NC(=O)N2)cc1)NC(=O)[C@H](CO)NC(=O)[C@@H](Cc1cccnc1)NC(=O)[C@@H](Cc1ccc(Cl)cc1)NC(=O)[C@@H](Cc1ccc2ccccc2c1)NC(C)=O)C(=O)N[C@@H](CCCCNC(C)C)C(=O)N1CCC[C@H]1C(=O)N[C@@H](C)CO
InChI Key InChIKey=PJRQWJXKIICEDW-DZDCYEBKSA-N
Data  1 IC50  1 Kd
  Tab Delimited (TSV)   2D SDfile   Computed 3D by Vconf -m prep SDfile
Find this compound or compounds like it in BindingDB:
Activity Spreadsheet -- Enzyme Inhibition Constant Data from BindingDB
Found 2 hits for monomerid = 50102448
TargetGonadotropin-releasing hormone receptor(Homo sapiens (Human))
Ferring Research Institute
Curated by ChEMBL
LigandPNGBDBM50102448(Ac-D-Nal-[D-(pCl)Phe]-D-Pal-Ser-[Aph(Hor)]-D-[Amf(...)
Affinity DataKd:  0.631nM. Assay description: Competitive antagonism of GnRH-induced response in the reporter gene assay
In DepthDetails ArticlePubMed
TargetGonadotropin-releasing hormone receptor(Homo sapiens (Human))
Ferring Research Institute
Curated by ChEMBL
LigandPNGBDBM50102448(Ac-D-Nal-[D-(pCl)Phe]-D-Pal-Ser-[Aph(Hor)]-D-[Amf(...)
Affinity DataIC50:  5.5nM. Assay description: Antagonism of human GnHR receptor, determined in a reporter gene assay in HEK293 cells
In DepthDetails ArticlePubMed