BDBM50102457 Ac-D-Nal-[D-(pCl)Phe]-D-Pal-Ser-[Aph(diureidoacetyl)]-D-[Aph(Ac)]-Leu-ILys-Pro-DAla-NH2::CHEMBL219799
SMILES CC(C)C[C@H](NC(=O)[C@@H](Cc1ccc(NC(C)=O)cc1)NC(=O)[C@H](Cc1ccc(NC(=O)C(NC(N)=O)NC(N)=O)cc1)NC(=O)[C@H](CO)NC(=O)[C@@H](Cc1cccnc1)NC(=O)[C@@H](Cc1ccc(Cl)cc1)NC(=O)[C@@H](Cc1ccc2ccccc2c1)NC(C)=O)C(=O)N[C@@H](CCCCNC(C)C)C(=O)N1CCC[C@H]1C(=O)N[C@H](C)C(N)=O
InChI Key InChIKey=USGCLNRHRPDNIJ-STRMTVNPSA-N
Data  1 IC50
  Tab Delimited (TSV)   2D SDfile   Computed 3D by Vconf -m prep SDfile
Find this compound or compounds like it in BindingDB:
Activity Spreadsheet -- Enzyme Inhibition Constant Data from BindingDB
Found 1 hit for monomerid = 50102457
TargetGonadotropin-releasing hormone receptor(Homo sapiens (Human))
Ferring Research Institute
Curated by ChEMBL
LigandPNGBDBM50102457(Ac-D-Nal-[D-(pCl)Phe]-D-Pal-Ser-[Aph(diureidoacety...)
Affinity DataIC50:  8.90nM. Assay description: Antagonism of human GnHR receptor, determined in a reporter gene assay in HEK293 cells
In DepthDetails ArticlePubMed