BDBM50102512 2,4-Diamino-5-{3-[3-[2-acetyloxy)ethyl]-3-(2-fluoro benzyl)triazen-1-yl]-4-chlorophenyl}-6-ethylpyrimidine::CHEMBL441062
SMILES CCc1nc(N)nc(N)c1-c1ccc(Cl)c(c1)\N=N\N(CCOC(C)=O)Cc1ccccc1F
InChI Key InChIKey=BKUKMQLXHBPECK-NVQSTNCTSA-N
Data  2 IC50
  Tab Delimited (TSV)   2D SDfile   Computed 3D by Vconf -m prep SDfile
Find this compound or compounds like it in BindingDB:
Activity Spreadsheet -- Enzyme Inhibition Constant Data from BindingDB
Found 2 hits for monomerid = 50102512
TargetDihydrofolate reductase(Rattus norvegicus (rat))
University Of Nottingham
Curated by ChEMBL
LigandPNGBDBM50102512(2,4-Diamino-5-{3-[3-[2-acetyloxy)ethyl]-3-(2-fluor...)
Affinity DataIC50:  1.49E+4nM. Assay description: Inhibitory activity against dihydrofolate reductase DHFR in rat liver
In DepthDetails ArticlePubMed
TargetBifunctional dihydrofolate reductase-thymidylate synthase(Toxoplasma gondii)
University Of Nottingham
Curated by ChEMBL
LigandPNGBDBM50102512(2,4-Diamino-5-{3-[3-[2-acetyloxy)ethyl]-3-(2-fluor...)
Affinity DataIC50:  7.80E+3nM. Assay description: Inhibitory activity against dihydrofolate reductase DHFR in Toxoplasma gondii.
In DepthDetails ArticlePubMed