BDBM50102820 CHEMBL3339354
SMILES COc1cc2c(Oc3ccc(CC(=O)N\N=C\c4ccc(cc4)C(F)(F)F)cc3F)ccnc2cc1OCCCN1CCOCC1
InChI Key InChIKey=PZIBOPQOMMNWBQ-LALXJTNGSA-N
Data  1 IC50
  Tab Delimited (TSV)   2D SDfile   Computed 3D by Vconf -m prep SDfile
Find this compound or compounds like it in BindingDB:
Activity Spreadsheet -- Enzyme Inhibition Constant Data from BindingDB
Found 1 hit for monomerid = 50102820
TargetHepatocyte growth factor receptor(Homo sapiens (Human))
Key Laboratory Of Structure-Based Drug Design And Discovery (Shenyang Pharmaceutical University)
Curated by ChEMBL
LigandPNGBDBM50102820(CHEMBL3339354)
Affinity DataIC50:  5.90nM. Assay description: Inhibition of c-Met (unknown origin) using poly (Glu, Tyr) 4:1 substrate by HTRF assay
In DepthDetails ArticlePubMed