BDBM50102882 6-Hydroxymethyl-tetrahydro-pyran-2,3,4,5-tetraol::CHEMBL98182
SMILES OCC1O[C@H](O)C(O)[C@@H](O)[C@@H]1O
InChI Key InChIKey=WQZGKKKJIJFFOK-KYKSVUQTSA-N
Data  1 KI
  Tab Delimited (TSV)   2D SDfile   Computed 3D by Vconf -m prep SDfile
Find this compound or compounds like it in BindingDB:
Activity Spreadsheet -- Enzyme Inhibition Constant Data from BindingDB
Found 1 hit for monomerid = 50102882
TargetGlycogen phosphorylase, brain form(Homo sapiens (Human))
University Of Debrecen
Curated by ChEMBL
LigandPNGBDBM50102882(6-Hydroxymethyl-tetrahydro-pyran-2,3,4,5-tetraol |...)
Affinity DataKi:  1.70E+6nM. Assay description: Inhibitory activity against muscle Glycogen Phosphorylase b
In DepthDetails ArticlePubMed