BDBM50102906 CHEMBL3394089
SMILES Fc1cccc(Nc2nc(SC3CCCC3)nc3n(CC(Cl)c4ccccc4)ncc23)c1
InChI Key InChIKey=FMSOZEKXLIPXKV-UHFFFAOYSA-N
Data  1 KI
  Tab Delimited (TSV)   2D SDfile   Computed 3D by Vconf -m prep SDfile
Find this compound or compounds like it in BindingDB:
Activity Spreadsheet -- Enzyme Inhibition Constant Data from BindingDB
Found 1 hit for monomerid = 50102906
TargetProto-oncogene tyrosine-protein kinase Src(Homo sapiens (Human))
Universit£
Curated by ChEMBL
LigandPNGBDBM50102906(CHEMBL3394089)
Affinity DataKi:  110nM. Assay description: Inhibition of human recombinant src kinase using KVEKIGEGTYGVVYK as substrate by filter binding assay in presence of [gamma-32P]ATP
In DepthDetails ArticlePubMed