BDBM50102913 CHEMBL3394098
SMILES CC(=O)Nc1cc(ccn1)-c1c(nc(SCCC(O)=O)n1C)-c1ccc(F)cc1
InChI Key InChIKey=DQAXOJBNTQVNHJ-UHFFFAOYSA-N
Data  2 IC50
  Tab Delimited (TSV)   2D SDfile   Computed 3D by Vconf -m prep SDfile
Find this compound or compounds like it in BindingDB:
Activity Spreadsheet -- Enzyme Inhibition Constant Data from BindingDB
Found 2 hits for monomerid = 50102913
TargetMitogen-activated protein kinase 10(Homo sapiens (Human))
Eberhard Karls Universit£T T£Bingen
Curated by ChEMBL
LigandPNGBDBM50102913(CHEMBL3394098)
Affinity DataIC50:  91nM. Assay description: Inhibition of JNK3 (unknown origin) assessed as phosphorylation of ATF-2 by ELISA
In DepthDetails ArticlePubMed
TargetMitogen-activated protein kinase 14(Homo sapiens (Human))
Eberhard Karls Universit£T T£Bingen
Curated by ChEMBL
LigandPNGBDBM50102913(CHEMBL3394098)
Affinity DataIC50:  246nM. Assay description: Inhibition of p38alpha (unknown origin) assessed as phosphorylation of ATF-2 by ELISA
In DepthDetails ArticlePubMed