BDBM50103150 CHEMBL3393179
SMILES OC(=O)Cc1cccc(NC(=O)c2ccccc2NC(=O)c2ccc(cc2)C(F)(F)F)c1
InChI Key InChIKey=WGEMFYPGQRNTAS-UHFFFAOYSA-N
Data  4 EC50
  Tab Delimited (TSV)   2D SDfile   Computed 3D by Vconf -m prep SDfile
Find this compound or compounds like it in BindingDB:
Activity Spreadsheet -- Enzyme Inhibition Constant Data from BindingDB
Found 4 hits for monomerid = 50103150
TargetPeroxisome proliferator-activated receptor gamma(Homo sapiens (Human))
Goethe-University Frankfurt
Curated by ChEMBL
LigandPNGBDBM50103150(CHEMBL3393179)
Affinity DataEC50:  9.40E+3nM. Assay description: Transactivation of Gal4-tagged PPARgamma ligand binding domain (unknown origin) expressed in COS7 cells measured after overnight incubation by lucife...
In DepthDetails ArticlePubMed
TargetPeroxisome proliferator-activated receptor alpha(Homo sapiens (Human))
Goethe-University Frankfurt
Curated by ChEMBL
LigandPNGBDBM50103150(CHEMBL3393179)
Affinity DataEC50:  5.40E+3nM. Assay description: Transactivation of Gal4-tagged PPARalpha ligand binding domain (unknown origin) expressed in COS7 cells measured after overnight incubation by lucife...
In DepthDetails ArticlePubMed
TargetBile acid receptor(Homo sapiens (Human))
Goethe-University Frankfurt
Curated by ChEMBL
LigandPNGBDBM50103150(CHEMBL3393179)
Affinity DataEC50:  2.60E+3nM. Assay description: Transactivation of human FXR expressed in human HeLa cells incubated for 24 hrs by luciferase reporter gene assay
In DepthDetails ArticlePubMed
TargetPeroxisome proliferator-activated receptor delta(Homo sapiens (Human))
Goethe-University Frankfurt
Curated by ChEMBL
LigandPNGBDBM50103150(CHEMBL3393179)
Affinity DataEC50:  2.20E+3nM. Assay description: Transactivation of Gal4-tagged PPARdelta ligand binding domain (unknown origin) expressed in COS7 cells measured after overnight incubation by lucife...
In DepthDetails ArticlePubMed