BDBM50103278 1-[3-Benzoyl-4-(2-phenyl-propionylamino)-phenylcarbamoyl]-2-mercapto-ethyl-ammonium; chloride::CHEMBL99172
SMILES CC(C(=O)Nc1ccc(NC(=O)[C@@H]([NH3+])CS)cc1C(=O)c1ccccc1)c1ccccc1
InChI Key InChIKey=IVAVBLJZUKLUKH-MRNPHLECSA-O
Data  1 IC50
  Tab Delimited (TSV)   2D SDfile   Computed 3D by Vconf -m prep SDfile
Find this compound or compounds like it in BindingDB:
Activity Spreadsheet -- Enzyme Inhibition Constant Data from BindingDB
Found 1 hit for monomerid = 50103278
TargetProtein farnesyltransferase subunit beta/geranylgeranyltransferase type-1 subunit alpha(Saccharomyces cerevisiae (Baker's yeast))
Philipps-UniversitäT Marburg
Curated by ChEMBL
LigandPNGBDBM50103278(1-[3-Benzoyl-4-(2-phenyl-propionylamino)-phenylcar...)
Affinity DataIC50:  650nM. Assay description: Inhibitory activity against farnesyltransferase.
In DepthDetails ArticlePubMed