BDBM50103400 CHEMBL3398209
SMILES Cc1cccc(c1)-c1cc(=O)n(CC2CCc3c(C2)cccc3OCC(O)=O)nc1-c1ccccc1
InChI Key InChIKey=DWWOTQACOVJOEC-UHFFFAOYSA-N
Data  3 EC50
  Tab Delimited (TSV)   2D SDfile   Computed 3D by Vconf -m prep SDfile
Find this compound or compounds like it in BindingDB:
Activity Spreadsheet -- Enzyme Inhibition Constant Data from BindingDB
Found 3 hits for monomerid = 50103400
TargetProstaglandin D2 receptor(Homo sapiens (Human))
Arena Pharmaceuticals
Curated by ChEMBL
LigandPNGBDBM50103400(CHEMBL3398209)
Affinity DataEC50:  25nM. Assay description: Agonist activity at human recombinant DP1 receptor expressed in melanophores assessed as induction of pigment redistribution incubated for 90 mins
In DepthDetails ArticlePubMed
TargetProstacyclin receptor(RAT)
Arena Pharmaceuticals
Curated by ChEMBL
LigandPNGBDBM50103400(CHEMBL3398209)
Affinity DataEC50:  370nM. Assay description: Agonist activity at rat recombinant IP receptor expressed in CHO-K1 cells incubated for 1 hr by HTRF cAMP assay
In DepthDetails ArticlePubMed
TargetProstacyclin receptor(Homo sapiens (Human))
Arena Pharmaceuticals
Curated by ChEMBL
LigandPNGBDBM50103400(CHEMBL3398209)
Affinity DataEC50:  180nM. Assay description: Agonist activity at human recombinant IP receptor expressed in CHO-K1 cells incubated for 1 hr by HTRF cAMP assay
In DepthDetails ArticlePubMed