BDBM50103490 CHEMBL3398295
SMILES COc1cc(O)c2c(c1)oc(cc2=O)C(O)=O
InChI Key InChIKey=LGMROWVWNCSLQC-UHFFFAOYSA-N
Data  2 IC50
  Tab Delimited (TSV)   2D SDfile   Computed 3D by Vconf -m prep SDfile
Find this compound or compounds like it in BindingDB:
Activity Spreadsheet -- Enzyme Inhibition Constant Data from BindingDB
Found 2 hits for monomerid = 50103490
TargetAcetylcholinesterase(Rattus norvegicus (rat))
Sichuan University
Curated by ChEMBL
LigandPNGBDBM50103490(CHEMBL3398295)
Affinity DataIC50: >2.00E+5nM. Assay description: Inhibition of AChE from rat cortex homogenate using acetylthiocholine iodide as substrate after 15 mins by Ellman method
In DepthDetails ArticlePubMed
TargetAcetylcholinesterase(Electrophorus electricus (Electric eel))
Sichuan University
Curated by ChEMBL
LigandPNGBDBM50103490(CHEMBL3398295)
Affinity DataIC50: >2.00E+5nM. Assay description: Inhibition of electric eel AChE using acetylthiocholine iodide as substrate after 15 mins by Ellman method
In DepthDetails ArticlePubMed