BDBM50103505 CHEBI:16709::Hexa-Betalin::M.V.I.-12::Pyridoxine::Vitamin B6
SMILES Cc1ncc(CO)c(CO)c1O
InChI Key InChIKey=LXNHXLLTXMVWPM-UHFFFAOYSA-N
Data  3 IC50
PDB links: 4 PDB IDs match this monomer.
  Tab Delimited (TSV)   2D SDfile   Computed 3D by Vconf -m prep SDfile
Find this compound or compounds like it in BindingDB:
Activity Spreadsheet -- Enzyme Inhibition Constant Data from BindingDB
Found 3 hits for monomerid = 50103505
TargetBile salt export pump(Rattus norvegicus)
Astrazeneca
Curated by ChEMBL
LigandPNGBDBM50103505(CHEBI:16709 | Hexa-Betalin | M.V.I.-12 | Pyridoxin...)
Affinity DataIC50: >1.00E+6nM. Assay description: Inhibition of Sprague-Dawley rat Bsep expressed in plasma membrane vesicles of Sf21 cells assessed as inhibition of ATP-dependent [3H]taurocholate up...
In DepthDetails ArticlePubMed
TargetBile salt export pump(Homo sapiens (Human))
Astrazeneca
Curated by ChEMBL
LigandPNGBDBM50103505(CHEBI:16709 | Hexa-Betalin | M.V.I.-12 | Pyridoxin...)
Affinity DataIC50: >1.00E+6nM. Assay description: Inhibitory affect against rabbit deoxycytidine kinase
In DepthDetails ArticlePubMed
TargetBile salt export pump(Homo sapiens (Human))
Astrazeneca
Curated by ChEMBL
LigandPNGBDBM50103505(CHEBI:16709 | Hexa-Betalin | M.V.I.-12 | Pyridoxin...)
Affinity DataIC50: >1.00E+6nM. Assay description: Inhibition of human BSEP expressed in plasma membrane vesicles of Sf21 cells assessed as inhibition of ATP-dependent [3H]taurocholate uptake
In DepthDetails ArticlePubMed