BDBM50103608 Anti-Lewisite::CHEBI:64198::Dimercaprol::Sulfactin
SMILES OCC(S)CS
InChI Key InChIKey=WQABCVAJNWAXTE-UHFFFAOYSA-N
Data  2 EC50
PDB links: 1 PDB ID matches this monomer.
  Tab Delimited (TSV)   2D SDfile   Computed 3D by Vconf -m prep SDfile
Find this compound or compounds like it in BindingDB:
Activity Spreadsheet -- Enzyme Inhibition Constant Data from BindingDB
Found 2 hits for monomerid = 50103608
TargetNuclear receptor subfamily 1 group I member 2(Homo sapiens (Human))
National Institutes Of Health Chemical Genomics Center
Curated by ChEMBL
LigandPNGBDBM50103608(Anti-Lewisite | CHEBI:64198 | Dimercaprol | Sulfac...)
Affinity DataEC50:  5.01E+4nM. Assay description: Activation of human PXR expressed in human HepG2 (DPX-2) cells assessed as induction of CYP3A4 after 24 hrs by luminescent analysis
In DepthDetails ArticlePubMed
TargetNuclear receptor subfamily 1 group I member 2(Homo sapiens (Human))
National Institutes Of Health Chemical Genomics Center
Curated by ChEMBL
LigandPNGBDBM50103608(Anti-Lewisite | CHEBI:64198 | Dimercaprol | Sulfac...)
Affinity DataEC50:  5.00E+3nM. Assay description: Competitive binding affinity to human PXR LBD (111 to 434) by TR-FRET assay
In DepthDetails ArticlePubMed