BDBM50103618 CHEBI:35001::CHEMBL3189011
SMILES [H][C@@]12CC[C@H](OC(=O)CCC(C)C)[C@@]1(C)CC[C@@]1([H])[C@@]2([H])CCC2=CC(=O)CC[C@]12C
InChI Key InChIKey=PPYHLSBUTAPNGT-BKWLFHPQSA-N
Data  3 EC50
  Tab Delimited (TSV)   2D SDfile   Computed 3D by Vconf -m prep SDfile
Find this compound or compounds like it in BindingDB:
Activity Spreadsheet -- Enzyme Inhibition Constant Data from BindingDB
Found 3 hits for monomerid = 50103618
TargetNuclear receptor subfamily 1 group I member 2(Homo sapiens (Human))
National Institutes Of Health Chemical Genomics Center
Curated by ChEMBL
LigandPNGBDBM50103618(CHEBI:35001 | CHEMBL3189011)
Affinity DataEC50:  2.82E+4nM. Assay description: Activation of human PXR expressed in human HepG2 (DPX-2) cells assessed as induction of CYP3A4 after 24 hrs by luminescent analysis
In DepthDetails ArticlePubMed
TargetNuclear receptor subfamily 1 group I member 2(Homo sapiens (Human))
National Institutes Of Health Chemical Genomics Center
Curated by ChEMBL
LigandPNGBDBM50103618(CHEBI:35001 | CHEMBL3189011)
Affinity DataEC50:  3.16E+4nM. Assay description: Activation of human PXR expressed in human HepG2 (DPX-2) cells after 24 hrs by luciferase reporter gene based luminescent analysis
In DepthDetails ArticlePubMed
TargetNuclear receptor subfamily 1 group I member 2(Homo sapiens (Human))
National Institutes Of Health Chemical Genomics Center
Curated by ChEMBL
LigandPNGBDBM50103618(CHEBI:35001 | CHEMBL3189011)
Affinity DataEC50:  1.12E+4nM. Assay description: Competitive binding affinity to human PXR LBD (111 to 434) by TR-FRET assay
In DepthDetails ArticlePubMed