BDBM50103690 CHEMBL307458::N-[4-(5-Amino-1-naphthalen-1-yl-1H-pyrazol-3-yl)-phenyl]-4-methoxy-benzenesulfonamide
SMILES COc1ccc(cc1)S(=O)(=O)Nc1ccc(cc1)-c1cc(N)n(n1)-c1cccc2ccccc12
InChI Key InChIKey=YWNGEGMHYFXUPC-UHFFFAOYSA-N
Data  1 IC50
  Tab Delimited (TSV)   2D SDfile   Computed 3D by Vconf -m prep SDfile
Find this compound or compounds like it in BindingDB:
Activity Spreadsheet -- Enzyme Inhibition Constant Data from BindingDB
Found 1 hit for monomerid = 50103690
TargetNeuropeptide Y receptor type 5(Homo sapiens (Human))
The R. W. Johnson Pharmaceutical Research Institute
Curated by ChEMBL
LigandPNGBDBM50103690(CHEMBL307458 | N-[4-(5-Amino-1-naphthalen-1-yl-1H-...)
Affinity DataIC50:  48nM. Assay description: Binding affinity towards human neuropeptide Y receptor type 5 in HEK 293 cell line, using [125I]-PYY as radioligand
In DepthDetails ArticlePubMed